Library not found for xcode

Unity2019とXcode11を使ってUnityのプロジェクトをビルドすると「library not found for -liPhone-lib」というエラーが出ることがあります。 ld: library not found for -liPhone-lib clang: error: linker command failed with exit code 1 (use -v to see invocation) Xcodeプロジェクトより上の階層に日本語のフォルダがあるとこのエラーが出る ...

ld library not found ld: library not found for -lSDLmain ld symbols not found Not found in archive library not found fo library not found not found for archit not found for option LD-LIBRARY library found ld: symbol(s) not found for architecture arm64 source not found symbol not found eth0: Device not found File not found xcode报错 XCode报错 xcode报错 ld ld iOS ld: library not found for ...
ld: framework not found Allegro-5.1 clang: error: linker command failed with exit code 1 (use-v to see invocation) 私はすでに実用的なフレームワークを持っていましたが、共有ライブラリとしてインストールされ、 "フレームワークモード"ではインストールされませんでした。

destiny 2 obelisk rank

Unity2019とXcode11を使ってUnityのプロジェクトをビルドすると「library not found for -liPhone-lib」というエラーが出ることがあります。 ld: library not found for -liPhone-lib clang: error: linker command failed with exit code 1 (use -v to see invocation) Xcodeプロジェクトより上の階層に日本語のフォルダがあるとこのエラーが出る ...

Mage bis enchants classic

Library not found for xcode

Dec 17, 2008 · This sounds so basic, but I am trying to add a library to my XCode 3.0 project so it will link. (It happens to be a dynamic library.) I have not found any line in the project settings/options that pertain directly to libraries, nor any menu option to "add library". When I tried to add -L...

ld library not found library not found fo library not found ld: library not found for -lSDLmain not found for archit not found for option library found Xcode报错 xcode 报错 mysql 5.5.19错误:Curses library not found source not found symbol not found eth0: Device not found File not found xcode报错 XCode报错 xcode报错 xcode调试报错 No entity found for query library Xcode ku iOS ...
Question: Q: ld: library not found for -lSystem.B - Xcode 4.2.1 can't seem to find this library when I use iOS 5 and deploy to simulator 关于 XCode ld: library not found for -lcurl clang的解决办法 时间 2013-04-27 有时候项目在自己电脑上运行正常,通过svn提交项目,再checkout下来的时候,再次运行却报错,如:

rdr2 screen tearing pc

ld: library not found for -lGoogleAnalyticsServices clang: error: linker command failed with exit code 1 (use -v to see invocation) I have tried almost everything. I saw that the Google Developers website said to use pod 'Google/Analytics', even after trying almost everything I could find on StackOverflow and Google regarding the error, I have ...

Craig bluetooth speaker